Information card for entry 7233550
Formula | C1.63 H1.5 N0.19 |
Calculated formula | C1.625 H1.5 N0.1875 |
Title of publication | Synthesis of two novel indolo[3,2-b]carbazole derivatives with aggregation-enhanced emission property |
Authors of publication | Wen-bin Jia; Hao-wei Wang; Long-mei Yang; Hong-bo Lu; Lin Kong; Yu-peng Tian; Xu-tang Tao; Jia-xiang Yang |
Journal of publication | Journal of Materials Chemistry C |
Year of publication | 2012 |
Journal volume | 1 |
Pages of publication | 7092 - 7101 |
a | 9.2346 ± 0.0014 Å |
b | 10.1144 ± 0.0015 Å |
c | 24.687 ± 0.004 Å |
α | 79.828 ± 0.002° |
β | 89.103 ± 0.002° |
γ | 72.21 ± 0.002° |
Cell volume | 2159.3 ± 0.6 Å3 |
Cell temperature | 296 ± 2 K |
Ambient diffraction temperature | 296 ± 2 K |
Number of distinct elements | 3 |
Space group number | 2 |
Hermann-Mauguin space group symbol | P -1 |
Hall space group symbol | -P 1 |
Residual factor for all reflections | 0.1183 |
Residual factor for significantly intense reflections | 0.0581 |
Weighted residual factors for significantly intense reflections | 0.1315 |
Weighted residual factors for all reflections included in the refinement | 0.1522 |
Goodness-of-fit parameter for all reflections included in the refinement | 1.03 |
Diffraction radiation wavelength | 0.71073 Å |
Diffraction radiation type | MoKα |