Information card for entry 7233554
Formula | C35 H34 Be Cl2 N2 O4 |
Calculated formula | C35 H34 Be Cl2 N2 O4 |
Title of publication | Morphology-dependent fluorescence ON/OFF of a beryllium complex: ACQ in amorphous solids, AEE in crystalline powders and the dark/bright fluorescence switch |
Authors of publication | Xiao Cheng; Houyu Zhang; Kaiqi Ye; Hongyu Zhang; Yue Wang |
Journal of publication | Journal of Materials Chemistry C |
Year of publication | 2012 |
Journal volume | 1 |
Pages of publication | 7507 - 7512 |
a | 21.027 ± 0.004 Å |
b | 9.855 ± 0.002 Å |
c | 15.357 ± 0.003 Å |
α | 90° |
β | 100.44 ± 0.03° |
γ | 90° |
Cell volume | 3129.6 ± 1.1 Å3 |
Cell temperature | 293 ± 2 K |
Ambient diffraction temperature | 293 ± 2 K |
Number of distinct elements | 6 |
Space group number | 15 |
Hermann-Mauguin space group symbol | C 1 2/c 1 |
Hall space group symbol | -C 2yc |
Residual factor for all reflections | 0.1882 |
Residual factor for significantly intense reflections | 0.0833 |
Weighted residual factors for significantly intense reflections | 0.1955 |
Weighted residual factors for all reflections included in the refinement | 0.2437 |
Goodness-of-fit parameter for all reflections included in the refinement | 1.051 |
Diffraction radiation wavelength | 0.71073 Å |
Diffraction radiation type | MoKα |