Information card for entry 7233560
Formula | C43 H78 Bi2 Cl4 O6 S12 |
Calculated formula | C43 H78 Bi2 Cl4 O6 S12 |
Title of publication | Bismuth sulphide-polymer nanocomposites from a highly soluble bismuth xanthate precursor |
Authors of publication | Verena Kaltenhauser; Thomas Rath; Wernfried Haas; Ana Torvisco; Stefan K. Muller; Bettina Friedel; Birgit Kunert; Robert Saf; Ferdinand Hofer; Gregor Trimmel |
Journal of publication | Journal of Materials Chemistry C |
Year of publication | 2012 |
Journal volume | 1 |
Pages of publication | 7825 - 7832 |
a | 24.505 ± 0.0008 Å |
b | 9.0961 ± 0.0003 Å |
c | 29.5784 ± 0.001 Å |
α | 90° |
β | 105.123 ± 0.002° |
γ | 90° |
Cell volume | 6364.7 ± 0.4 Å3 |
Cell temperature | 100 ± 2 K |
Ambient diffraction temperature | 100 ± 2 K |
Number of distinct elements | 6 |
Space group number | 15 |
Hermann-Mauguin space group symbol | C 1 2/c 1 |
Hall space group symbol | -C 2yc |
Residual factor for all reflections | 0.0396 |
Residual factor for significantly intense reflections | 0.0356 |
Weighted residual factors for significantly intense reflections | 0.0844 |
Weighted residual factors for all reflections included in the refinement | 0.0867 |
Goodness-of-fit parameter for all reflections included in the refinement | 1.064 |
Diffraction radiation wavelength | 0.71073 Å |
Diffraction radiation type | MoKα |