Information card for entry 7234231
Formula | C27 H17 Cl N2 |
Calculated formula | C27 H17 Cl N2 |
Title of publication | Aggregation-enhanced emissive mechanofluorochromic carbazole-halogen positional isomers: tunable fluorescence via conformational polymorphism and crystallization-induced fluorescence switching |
Authors of publication | Gayathri, Parthasarathy; Karthikeyan, Subramanian; Pannipara, Mehboobali; Al-Sehemi, Abdullah G.; Moon, Dohyun; Anthony, Savarimuthu Philip |
Journal of publication | CrystEngComm |
Year of publication | 2019 |
Journal volume | 21 |
Journal issue | 43 |
Pages of publication | 6604 |
a | 14.47 ± 0.003 Å |
b | 8.437 ± 0.0017 Å |
c | 17.241 ± 0.003 Å |
α | 90° |
β | 110.23 ± 0.03° |
γ | 90° |
Cell volume | 1975 ± 0.8 Å3 |
Cell temperature | 220 ± 2 K |
Ambient diffraction temperature | 220 ± 2 K |
Number of distinct elements | 4 |
Space group number | 14 |
Hermann-Mauguin space group symbol | P 1 21/c 1 |
Hall space group symbol | -P 2ybc |
Residual factor for all reflections | 0.0523 |
Residual factor for significantly intense reflections | 0.0477 |
Weighted residual factors for significantly intense reflections | 0.1404 |
Weighted residual factors for all reflections included in the refinement | 0.1441 |
Goodness-of-fit parameter for all reflections included in the refinement | 1.089 |
Diffraction radiation wavelength | 0.61 Å |
Diffraction radiation type | synchrotron |