Information card for entry 7234465
Formula | C150 H158 Dy N24 Tb |
Calculated formula | C150 H158 Dy N24 Tb |
Title of publication | Magnetic interplay between two different lanthanides in a tris-phthalocyaninato complex: a viable synthetic route and detailed investigation in the bulk and on the surface |
Authors of publication | Yanhua Lan; Svetlana Klyatskaya; Mario Ruben; Olaf Fuhr; Wolfgang Wernsdorfer; Andrea Candini; Valdis Corradini; Alberto Lodi Rizzini; Umberto del Pennino; Filippo Troiani; Loic Joly; David Klar; Heiko Wende; Marco Affronte |
Journal of publication | Journal of Materials Chemistry C |
Year of publication | 2015 |
Journal volume | 3 |
Pages of publication | 9794 - 9801 |
a | 26.4588 ± 0.0006 Å |
b | 20.8628 ± 0.0006 Å |
c | 24.7745 ± 0.0007 Å |
α | 90° |
β | 109.148 ± 0.002° |
γ | 90° |
Cell volume | 12919 ± 0.6 Å3 |
Cell temperature | 180 ± 2 K |
Ambient diffraction temperature | 180 ± 2 K |
Number of distinct elements | 5 |
Space group number | 14 |
Hermann-Mauguin space group symbol | P 1 21/c 1 |
Hall space group symbol | -P 2ybc |
Residual factor for all reflections | 0.0824 |
Residual factor for significantly intense reflections | 0.0392 |
Weighted residual factors for significantly intense reflections | 0.0865 |
Weighted residual factors for all reflections included in the refinement | 0.0961 |
Goodness-of-fit parameter for all reflections included in the refinement | 0.849 |
Diffraction radiation wavelength | 0.71073 Å |
Diffraction radiation type | MoKα |