Information card for entry 7234790
Formula | C18 Co N10 |
Calculated formula | C18 Co N10 |
Title of publication | Multiple phase and dielectric transitions on a novel multi-sensitive [TPrA][M(dca)3] (M: Fe2+, Co2+ and Ni2+) hybrid inorganic-organic perovskite family |
Authors of publication | J. M. Bermudez-Garcia; M. Sanchez-Andujar; S. Yanez-Vilar; S. Castro-Garcia; R. Artiaga; J. Lopez-Beceiro; L. Botana; A. Alegria; M. A. Senaris-Rodriguez |
Journal of publication | Journal of Materials Chemistry C |
Year of publication | 2016 |
Journal volume | 4 |
Pages of publication | 4889 - 4898 |
a | 11.4551 ± 0.0002 Å |
b | 11.4551 ± 0.0002 Å |
c | 17.4294 ± 0.0003 Å |
α | 90° |
β | 90° |
γ | 90° |
Cell volume | 2287.07 ± 0.07 Å3 |
Cell temperature | 368 ± 2 K |
Ambient diffraction temperature | 368 ± 2 K |
Number of distinct elements | 3 |
Space group number | 140 |
Hermann-Mauguin space group symbol | I 4/m c m |
Hall space group symbol | -I 4 2c |
Residual factor for all reflections | 0.0602 |
Residual factor for significantly intense reflections | 0.0505 |
Weighted residual factors for significantly intense reflections | 0.1449 |
Weighted residual factors for all reflections included in the refinement | 0.1591 |
Goodness-of-fit parameter for all reflections included in the refinement | 1.105 |
Diffraction radiation wavelength | 0.71073 Å |
Diffraction radiation type | MoKα |