Information card for entry 7234792
Formula | C14 H14 Br4 O6 |
Calculated formula | C14 H14 Br4 O6 |
Title of publication | Two-dimensional halogen-bonded organic frameworks based on the tetrabromobenzene-1,4-dicarboxylic acid building molecule |
Authors of publication | Chongboriboon, Nucharee; Samakun, Kodchakorn; Inprasit, Thitirat; Kielar, Filip; Dungkaew, Winya; Wong, Lawrence W.-Y.; Sung, Herman H.-Y.; Ninković, Dragan B.; Zarić, Snežana D.; Chainok, Kittipong |
Journal of publication | CrystEngComm |
Year of publication | 2020 |
Journal volume | 22 |
Journal issue | 1 |
Pages of publication | 24 - 34 |
a | 25.174 ± 0.005 Å |
b | 9.1572 ± 0.0018 Å |
c | 8.9838 ± 0.0017 Å |
α | 90° |
β | 93.25 ± 0.007° |
γ | 90° |
Cell volume | 2067.6 ± 0.7 Å3 |
Cell temperature | 296 K |
Ambient diffraction temperature | 296 K |
Number of distinct elements | 4 |
Space group number | 15 |
Hermann-Mauguin space group symbol | C 1 2/c 1 |
Hall space group symbol | -C 2yc |
Residual factor for all reflections | 0.0488 |
Residual factor for significantly intense reflections | 0.0306 |
Weighted residual factors for significantly intense reflections | 0.0598 |
Weighted residual factors for all reflections included in the refinement | 0.0655 |
Goodness-of-fit parameter for all reflections included in the refinement | 1.02 |
Diffraction radiation probe | x-ray |
Diffraction radiation wavelength | 0.71073 Å |
Diffraction radiation type | MoKα |