Information card for entry 7234797
Formula | C12 H14 Br4 O6 |
Calculated formula | C12 H14 Br4 O6 |
Title of publication | Two-dimensional halogen-bonded organic frameworks based on the tetrabromobenzene-1,4-dicarboxylic acid building molecule |
Authors of publication | Chongboriboon, Nucharee; Samakun, Kodchakorn; Inprasit, Thitirat; Kielar, Filip; Dungkaew, Winya; Wong, Lawrence W.-Y.; Sung, Herman H.-Y.; Ninković, Dragan B.; Zarić, Snežana D.; Chainok, Kittipong |
Journal of publication | CrystEngComm |
Year of publication | 2020 |
Journal volume | 22 |
Journal issue | 1 |
Pages of publication | 24 - 34 |
a | 9.27849 ± 0.00019 Å |
b | 23.5754 ± 0.0005 Å |
c | 8.6023 ± 0.0002 Å |
α | 90° |
β | 90° |
γ | 90° |
Cell volume | 1881.7 ± 0.07 Å3 |
Cell temperature | 100.02 ± 0.1 K |
Ambient diffraction temperature | 100.02 ± 0.1 K |
Number of distinct elements | 4 |
Space group number | 62 |
Hermann-Mauguin space group symbol | P n m a |
Hall space group symbol | -P 2ac 2n |
Residual factor for all reflections | 0.0316 |
Residual factor for significantly intense reflections | 0.0294 |
Weighted residual factors for significantly intense reflections | 0.079 |
Weighted residual factors for all reflections included in the refinement | 0.0809 |
Goodness-of-fit parameter for all reflections included in the refinement | 1.057 |
Diffraction radiation wavelength | 1.54184 Å |
Diffraction radiation type | CuKα |