Information card for entry 7234852
Formula | C74 H126 Er2 N4 O63.5 S8 |
Calculated formula | C74 H78 Er2 N4 O63.4991 S8 |
Title of publication | Influence of ortho- and meta-substituted N-heterocyclic dications towards the self-assembly of p-sulfonatocalix[4]arene |
Authors of publication | Loh, Sze Le; Sobolev, Alexandre N.; Lim, Siew Huah; Ling, Irene |
Journal of publication | CrystEngComm |
Year of publication | 2020 |
Journal volume | 22 |
Journal issue | 1 |
Pages of publication | 52 - 60 |
a | 15.0362 ± 0.0002 Å |
b | 17.4614 ± 0.0003 Å |
c | 21.0544 ± 0.0003 Å |
α | 100.755 ± 0.001° |
β | 95.9 ± 0.001° |
γ | 98.544 ± 0.001° |
Cell volume | 5321.84 ± 0.14 Å3 |
Cell temperature | 100 ± 2 K |
Ambient diffraction temperature | 100 ± 2 K |
Number of distinct elements | 6 |
Space group number | 2 |
Hermann-Mauguin space group symbol | P -1 |
Hall space group symbol | -P 1 |
Residual factor for all reflections | 0.0865 |
Residual factor for significantly intense reflections | 0.0752 |
Weighted residual factors for significantly intense reflections | 0.1866 |
Weighted residual factors for all reflections included in the refinement | 0.1949 |
Goodness-of-fit parameter for all reflections included in the refinement | 1.003 |
Diffraction radiation wavelength | 0.71073 Å |
Diffraction radiation type | MoKα |