Information card for entry 7234922
Formula | C6 H16 Br5 N2 Sb |
Calculated formula | C6 H16 Br5 N2 Sb |
Title of publication | Near-room-temperature tunable dielectric response induced by dual phase transitions in a lead-free hybrid: (C3H8N)2SbBr5 |
Authors of publication | Li, Maofan; Teng, Bing; Han, Shiguo; Yang, Tao; Li, Yaobin; Liu, Yi; Zhang, Xinyuan; Liu, Xitao; Luo, Junhua; Sun, Zhihua |
Journal of publication | CrystEngComm |
Year of publication | 2019 |
Journal volume | 21 |
Journal issue | 24 |
Pages of publication | 3740 |
a | 22.5314 ± 0.0007 Å |
b | 18.9885 ± 0.0008 Å |
c | 7.8845 ± 0.0003 Å |
α | 90° |
β | 90° |
γ | 90° |
Cell volume | 3373.3 ± 0.2 Å3 |
Cell temperature | 300 ± 2 K |
Ambient diffraction temperature | 300.15 K |
Number of distinct elements | 5 |
Space group number | 60 |
Hermann-Mauguin space group symbol | P n c a |
Hall space group symbol | -P 2a 2n |
Residual factor for all reflections | 0.1203 |
Residual factor for significantly intense reflections | 0.0527 |
Weighted residual factors for significantly intense reflections | 0.1171 |
Weighted residual factors for all reflections included in the refinement | 0.1477 |
Goodness-of-fit parameter for all reflections included in the refinement | 1.005 |
Diffraction radiation wavelength | 0.71073 Å |
Diffraction radiation type | MoKα |