Information card for entry 7235110
Formula | C14 H8 Cu N2 O5 |
Calculated formula | C14 H8 Cu N2 O5 |
Title of publication | Unusual adsorption behaviours and responsive structural dynamics via selective gate effects of an hourglass porous metal‒organic framework |
Authors of publication | Xiong, Ying; Fan, Yan-Zhong; Wei, Zhang-Wen; Chen, Cheng-Xia; Chen, Sha; Wang, Dawei; Barboiu, Mihail; Jiang, Ji-Jun; Su, Cheng-Yong |
Journal of publication | RSC Advances |
Year of publication | 2019 |
Journal volume | 9 |
Journal issue | 64 |
Pages of publication | 37222 |
a | 17.993 ± 0.003 Å |
b | 17.993 ± 0.003 Å |
c | 69.267 ± 0.014 Å |
α | 90° |
β | 90° |
γ | 120° |
Cell volume | 19421 ± 6 Å3 |
Cell temperature | 435 ± 2 K |
Ambient diffraction temperature | 435.15 K |
Number of distinct elements | 5 |
Space group number | 167 |
Hermann-Mauguin space group symbol | R -3 c :H |
Hall space group symbol | -R 3 2"c |
Residual factor for all reflections | 0.1962 |
Residual factor for significantly intense reflections | 0.1294 |
Weighted residual factors for significantly intense reflections | 0.3374 |
Weighted residual factors for all reflections included in the refinement | 0.3791 |
Goodness-of-fit parameter for all reflections included in the refinement | 1.161 |
Diffraction radiation wavelength | 1.54178 Å |
Diffraction radiation type | CuKα |