Information card for entry 7235115
Formula | C19 H25 N5 |
Calculated formula | C19 H25 N5 |
Title of publication | Diaminomaleonitrile-based Schiff bases: aggregation-enhanced emission, red fluorescence, mechanochromism and bioimaging applications |
Authors of publication | Ting Han; Xinggui Gu; Jacky W. Y. Lam; Anakin C. S. Leung; Ryan T. K. Kwok; Tianyu Han; Bin Tong; Jianbing Shi; Yuping Dong; Ben Zhong Tang |
Journal of publication | Journal of Materials Chemistry C |
Year of publication | 2016 |
Journal volume | 4 |
Pages of publication | 10430 - 10434 |
a | 13.594 ± 0.003 Å |
b | 13.655 ± 0.003 Å |
c | 20.363 ± 0.004 Å |
α | 90° |
β | 98.363 ± 0.002° |
γ | 90° |
Cell volume | 3739.7 ± 1.4 Å3 |
Cell temperature | 153.15 K |
Ambient diffraction temperature | 153.15 K |
Number of distinct elements | 3 |
Space group number | 14 |
Hermann-Mauguin space group symbol | P 1 21/c 1 |
Hall space group symbol | -P 2ybc |
Residual factor for all reflections | 0.0643 |
Residual factor for significantly intense reflections | 0.0545 |
Weighted residual factors for significantly intense reflections | 0.144 |
Weighted residual factors for all reflections included in the refinement | 0.1516 |
Goodness-of-fit parameter for all reflections included in the refinement | 1.001 |
Diffraction radiation wavelength | 0.71073 Å |
Diffraction radiation type | MoKα |