Information card for entry 7235205
Formula | C28 H40 Cl6 F4 I2 N4 Ru |
Calculated formula | C28 H40 Cl6 F4 I2 N4 Ru |
Title of publication | Halogen bonding (HaB) in E‒I⋯X‒M systems: influence of the halogen donor on the HaB nature |
Authors of publication | Dortéz, Silvia; Fernández-Palacio, Francisco; Damián, Jesús; Gaiteiro, Carlos; Ramos, Javier; Gómez-Sal, Pilar; Mosquera, Marta E. G. |
Journal of publication | CrystEngComm |
Year of publication | 2020 |
Journal volume | 22 |
Journal issue | 5 |
Pages of publication | 870 - 877 |
a | 9.19 ± 0.0005 Å |
b | 9.434 ± 0.002 Å |
c | 13.143 ± 0.003 Å |
α | 88.54 ± 0.02° |
β | 69.663 ± 0.012° |
γ | 86.654 ± 0.016° |
Cell volume | 1066.6 ± 0.3 Å3 |
Cell temperature | 200 ± 2 K |
Ambient diffraction temperature | 200 ± 2 K |
Number of distinct elements | 7 |
Space group number | 2 |
Hermann-Mauguin space group symbol | P -1 |
Hall space group symbol | -P 1 |
Residual factor for all reflections | 0.0737 |
Residual factor for significantly intense reflections | 0.036 |
Weighted residual factors for significantly intense reflections | 0.0779 |
Weighted residual factors for all reflections included in the refinement | 0.0914 |
Goodness-of-fit parameter for all reflections included in the refinement | 0.916 |
Diffraction radiation probe | x-ray |
Diffraction radiation wavelength | 0.71073 Å |
Diffraction radiation type | MoKα |