Information card for entry 7235208
Formula | C22 H14 F6 I6 O4 Pt |
Calculated formula | C22 H14 F6 I6 O4 Pt |
Title of publication | Metal-involving halogen bond Ar‒I⋯[dz2PtII] in a platinum acetylacetonate complex |
Authors of publication | Rozhkov, Anton V.; Ivanov, Daniil M.; Novikov, Alexander S.; Ananyev, Ivan V.; Bokach, Nadezhda A.; Kukushkin, Vadim Yu. |
Journal of publication | CrystEngComm |
Year of publication | 2020 |
Journal volume | 22 |
Journal issue | 3 |
Pages of publication | 554 - 563 |
a | 12.1215 ± 0.0004 Å |
b | 17.8414 ± 0.0006 Å |
c | 7.3462 ± 0.0002 Å |
α | 90° |
β | 99.739 ± 0.001° |
γ | 90° |
Cell volume | 1565.83 ± 0.09 Å3 |
Cell temperature | 100 ± 2 K |
Ambient diffraction temperature | 100 ± 2 K |
Number of distinct elements | 6 |
Space group number | 14 |
Hermann-Mauguin space group symbol | P 1 21/c 1 |
Hall space group symbol | -P 2ybc |
Residual factor for all reflections | 0.0249 |
Residual factor for significantly intense reflections | 0.0219 |
Weighted residual factors for significantly intense reflections | 0.046 |
Weighted residual factors for all reflections included in the refinement | 0.047 |
Goodness-of-fit parameter for all reflections included in the refinement | 1.105 |
Diffraction radiation wavelength | 0.71073 Å |
Diffraction radiation type | MoKα |