Information card for entry 7235212
Formula | C22 H14 F6 I6 O4 Pt |
Calculated formula | C22 H14 F6 I6 O4 Pt |
Title of publication | Metal-involving halogen bond Ar‒I⋯[dz2PtII] in a platinum acetylacetonate complex |
Authors of publication | Rozhkov, Anton V.; Ivanov, Daniil M.; Novikov, Alexander S.; Ananyev, Ivan V.; Bokach, Nadezhda A.; Kukushkin, Vadim Yu. |
Journal of publication | CrystEngComm |
Year of publication | 2020 |
Journal volume | 22 |
Journal issue | 3 |
Pages of publication | 554 - 563 |
a | 12.1714 ± 0.0004 Å |
b | 17.8866 ± 0.0006 Å |
c | 7.4115 ± 0.0003 Å |
α | 90° |
β | 99.909 ± 0.001° |
γ | 90° |
Cell volume | 1589.45 ± 0.1 Å3 |
Cell temperature | 100 ± 2 K |
Ambient diffraction temperature | 100 ± 2 K |
Number of distinct elements | 6 |
Space group number | 14 |
Hermann-Mauguin space group symbol | P 1 21/c 1 |
Hall space group symbol | -P 2ybc |
Residual factor for all reflections | 0.0325 |
Residual factor for significantly intense reflections | 0.0269 |
Weighted residual factors for significantly intense reflections | 0.0544 |
Weighted residual factors for all reflections included in the refinement | 0.0561 |
Goodness-of-fit parameter for all reflections included in the refinement | 1.211 |
Diffraction radiation wavelength | 0.71073 Å |
Diffraction radiation type | MoKα |