Information card for entry 7235223
Formula | C40 H26 N2 O4 |
Calculated formula | C40 H26 N2 O4 |
Title of publication | Co-crystals of 9,9′-bianthracene-10,10′-dicarboxylic acid with linear bidentate basic ligand molecules: synthesis, crystal structure, and properties based on the layer structure exfoliated by water |
Authors of publication | Okayasu, Misaki; Kikkawa, Shoko; Hikawa, Hidemasa; Azumaya, Isao |
Journal of publication | CrystEngComm |
Year of publication | 2020 |
Journal volume | 22 |
Journal issue | 3 |
Pages of publication | 497 - 505 |
a | 14.3333 ± 0.0005 Å |
b | 11.8876 ± 0.0004 Å |
c | 16.9672 ± 0.0006 Å |
α | 90° |
β | 96.463 ± 0.003° |
γ | 90° |
Cell volume | 2872.64 ± 0.17 Å3 |
Cell temperature | 93 K |
Ambient diffraction temperature | 93 K |
Number of distinct elements | 4 |
Space group number | 14 |
Hermann-Mauguin space group symbol | P 1 21/c 1 |
Hall space group symbol | -P 2ybc |
Residual factor for all reflections | 0.0957 |
Residual factor for significantly intense reflections | 0.053 |
Weighted residual factors for significantly intense reflections | 0.1046 |
Weighted residual factors for all reflections included in the refinement | 0.1176 |
Goodness-of-fit parameter for all reflections included in the refinement | 1.024 |
Diffraction radiation wavelength | 0.71073 Å |
Diffraction radiation type | MoKα |