Information card for entry 7235228
Formula | C24 H16 Co N2 O4 |
Calculated formula | C24 H16 Co N2 O4 |
Title of publication | Coordination polymers with salicylaldehyde ligands: structural diversity, selective sorption and luminescence sensing properties |
Authors of publication | Liu, Yi; Zhao, Yue; Liu, Zhi-Qiang; Liu, Xiao-Hui; Zhang, Xiu-Du; Sun, Wei-Yin |
Journal of publication | CrystEngComm |
Year of publication | 2020 |
Journal volume | 22 |
Journal issue | 2 |
Pages of publication | 304 - 310 |
a | 8.7775 ± 0.0005 Å |
b | 6.8216 ± 0.0005 Å |
c | 16.1117 ± 0.0009 Å |
α | 90° |
β | 105.151 ± 0.002° |
γ | 90° |
Cell volume | 931.18 ± 0.1 Å3 |
Cell temperature | 193 ± 2 K |
Ambient diffraction temperature | 193 ± 2 K |
Number of distinct elements | 5 |
Space group number | 14 |
Hermann-Mauguin space group symbol | P 1 21/n 1 |
Hall space group symbol | -P 2yn |
Residual factor for all reflections | 0.0405 |
Residual factor for significantly intense reflections | 0.0382 |
Weighted residual factors for significantly intense reflections | 0.1103 |
Weighted residual factors for all reflections included in the refinement | 0.1118 |
Goodness-of-fit parameter for all reflections included in the refinement | 1.124 |
Diffraction radiation wavelength | 0.71073 Å |
Diffraction radiation type | MoKα |