Information card for entry 7235882
Formula | C23 H28 Cd N2 O9 |
Calculated formula | C23 H28 Cd N2 O9 |
Title of publication | Unique topological motifs in two Cd(ii)-coordination polymers: mutual-embedded 2D bilayers, 3D polythreaded structures, self-penetrated networks and 2D →2D interpenetrated homochiral bilayers |
Authors of publication | Xu, Guo-Wang; Wu, Ya-Pan; Wang, Hai-Bing; Wang, Ye-Nan; Li, Dong-Sheng; Liu, Yun-Ling |
Journal of publication | CrystEngComm |
Year of publication | 2015 |
Journal volume | 17 |
Journal issue | 47 |
Pages of publication | 9055 |
a | 21.234 ± 0.009 Å |
b | 15.744 ± 0.006 Å |
c | 16.213 ± 0.007 Å |
α | 90° |
β | 113.443 ± 0.004° |
γ | 90° |
Cell volume | 4973 ± 4 Å3 |
Cell temperature | 296 ± 2 K |
Ambient diffraction temperature | 296 ± 2 K |
Number of distinct elements | 5 |
Space group number | 15 |
Hermann-Mauguin space group symbol | C 1 2/c 1 |
Hall space group symbol | -C 2yc |
Residual factor for all reflections | 0.1457 |
Residual factor for significantly intense reflections | 0.0867 |
Weighted residual factors for significantly intense reflections | 0.2204 |
Weighted residual factors for all reflections included in the refinement | 0.2975 |
Goodness-of-fit parameter for all reflections included in the refinement | 1.065 |
Diffraction radiation wavelength | 0.71073 Å |
Diffraction radiation type | MoKα |