Information card for entry 7235896
Formula | C32 H28 N2 O2 |
Calculated formula | C32 H28 N2 O2 |
Title of publication | Synthesis of 4-quinolones, benzopyran derivatives and other fused systems based on the domino ANRORC reactions of (ortho-fluoro)-3-benzoylchromones |
Authors of publication | Iaroshenko, Viktor O.; Mkrtchyan, Satenik; Gevorgyan, Ashot; Grigoryan, Tatevik; Villinger, Alexander; Langer, Peter |
Journal of publication | RSC Advances |
Year of publication | 2015 |
Journal volume | 5 |
Journal issue | 36 |
Pages of publication | 28717 |
a | 31.6167 ± 0.001 Å |
b | 10.4048 ± 0.0003 Å |
c | 16.4565 ± 0.0005 Å |
α | 90° |
β | 114.191 ± 0.002° |
γ | 90° |
Cell volume | 4938.2 ± 0.3 Å3 |
Cell temperature | 173 ± 2 K |
Ambient diffraction temperature | 173 ± 2 K |
Number of distinct elements | 4 |
Space group number | 15 |
Hermann-Mauguin space group symbol | C 1 2/c 1 |
Hall space group symbol | -C 2yc |
Residual factor for all reflections | 0.0835 |
Residual factor for significantly intense reflections | 0.0481 |
Weighted residual factors for significantly intense reflections | 0.1076 |
Weighted residual factors for all reflections included in the refinement | 0.1282 |
Goodness-of-fit parameter for all reflections included in the refinement | 1.008 |
Diffraction radiation wavelength | 0.71073 Å |
Diffraction radiation type | MoKα |