Information card for entry 7235907
Formula | C52 H50 N2 O7 S2 |
Calculated formula | C52 H50 N2 O7 S2 |
Title of publication | Nature of reactant and influence of water on the supramolecular patterns and luminescent properties of organic salts comprising (1,1′-biphenyl)-4,4′-disulfonate and triphenylmethanaminium |
Authors of publication | Li, Ya-Nan; Huo, Li-Hua; Deng, Zhao-Peng; Xie, Xin-Yu; Zhu, Zhi-Biao; Gao, Shan |
Journal of publication | RSC Advances |
Year of publication | 2015 |
Journal volume | 5 |
Journal issue | 52 |
Pages of publication | 41692 |
a | 15.3836 ± 0.0005 Å |
b | 15.5242 ± 0.0003 Å |
c | 19.5258 ± 0.0006 Å |
α | 90° |
β | 100.466 ± 0.003° |
γ | 90° |
Cell volume | 4585.5 ± 0.2 Å3 |
Cell temperature | 295 ± 2 K |
Ambient diffraction temperature | 295 ± 2 K |
Number of distinct elements | 5 |
Space group number | 14 |
Hermann-Mauguin space group symbol | P 1 21/n 1 |
Hall space group symbol | -P 2yn |
Residual factor for all reflections | 0.0884 |
Residual factor for significantly intense reflections | 0.0569 |
Weighted residual factors for significantly intense reflections | 0.1194 |
Weighted residual factors for all reflections included in the refinement | 0.1356 |
Goodness-of-fit parameter for all reflections included in the refinement | 1.033 |
Diffraction radiation wavelength | 0.71073 Å |
Diffraction radiation type | MoKα |