Information card for entry 7235949
Formula | C25 H34 N2 O4 S |
Calculated formula | C25 H34 N2 O4 S |
Title of publication | Labile dioxy-functionalised zwitterionic imidazolinium salt: access to zwitterionic and neutral imidazolidin-2-ylidene derivatives and π-acceptor properties of imidazolidine-2-selones |
Authors of publication | Gupta, Vivek; Karthik, Vedhagiri; Anantharaman, Ganapathi |
Journal of publication | RSC Advances |
Year of publication | 2015 |
Journal volume | 5 |
Journal issue | 107 |
Pages of publication | 87888 |
a | 7.1062 ± 0.0009 Å |
b | 22.149 ± 0.003 Å |
c | 16.237 ± 0.002 Å |
α | 90° |
β | 99.192 ± 0.002° |
γ | 90° |
Cell volume | 2522.8 ± 0.6 Å3 |
Cell temperature | 100 ± 2 K |
Ambient diffraction temperature | 100 ± 2 K |
Number of distinct elements | 5 |
Space group number | 14 |
Hermann-Mauguin space group symbol | P 1 21/n 1 |
Hall space group symbol | -P 2yn |
Residual factor for all reflections | 0.0722 |
Residual factor for significantly intense reflections | 0.0498 |
Weighted residual factors for significantly intense reflections | 0.1221 |
Weighted residual factors for all reflections included in the refinement | 0.1427 |
Goodness-of-fit parameter for all reflections included in the refinement | 1.033 |
Diffraction radiation wavelength | 0.71073 Å |
Diffraction radiation type | MoKα |