Information card for entry 7235956
Formula | C33 H34 B F2 N2 O2 P |
Calculated formula | C33 H34 B F2 N2 O2 P |
Title of publication | Labile dioxy-functionalised zwitterionic imidazolinium salt: access to zwitterionic and neutral imidazolidin-2-ylidene derivatives and π-acceptor properties of imidazolidine-2-selones |
Authors of publication | Gupta, Vivek; Karthik, Vedhagiri; Anantharaman, Ganapathi |
Journal of publication | RSC Advances |
Year of publication | 2015 |
Journal volume | 5 |
Journal issue | 107 |
Pages of publication | 87888 |
a | 11.811 ± 0.005 Å |
b | 14.264 ± 0.005 Å |
c | 17.76 ± 0.005 Å |
α | 90 ± 0.005° |
β | 102.367 ± 0.005° |
γ | 90 ± 0.005° |
Cell volume | 2922.6 ± 1.8 Å3 |
Cell temperature | 273 ± 2 K |
Ambient diffraction temperature | 273 ± 2 K |
Number of distinct elements | 7 |
Space group number | 14 |
Hermann-Mauguin space group symbol | P 1 21/n 1 |
Hall space group symbol | -P 2yn |
Residual factor for all reflections | 0.116 |
Residual factor for significantly intense reflections | 0.0608 |
Weighted residual factors for significantly intense reflections | 0.1162 |
Weighted residual factors for all reflections included in the refinement | 0.139 |
Goodness-of-fit parameter for all reflections included in the refinement | 1.021 |
Diffraction radiation wavelength | 0.71073 Å |
Diffraction radiation type | MoKα |