Information card for entry 7235974
Formula | C10 H9 B F2 N2 |
Calculated formula | C10 H9 B F2 N2 |
Title of publication | Unusual spectroscopic and photophysical properties of meso-tert-butylBODIPY in comparison to related alkylated BODIPY dyes |
Authors of publication | Jiao, Lijuan; Yu, Changjiang; Wang, Jun; Briggs, Edward A.; Besley, Nicholas A.; Robinson, David; Ruedas-Rama, María J.; Orte, Angel; Crovetto, Luis; Talavera, Eva M.; Alvarez-Pez, Jose M.; Van der Auweraer, Mark; Boens, Noël |
Journal of publication | RSC Advances |
Year of publication | 2015 |
Journal volume | 5 |
Journal issue | 109 |
Pages of publication | 89375 |
a | 7.7265 ± 0.0007 Å |
b | 7.7446 ± 0.0007 Å |
c | 16.6941 ± 0.0015 Å |
α | 102.946 ± 0.001° |
β | 93.552 ± 0.001° |
γ | 92.329 ± 0.001° |
Cell volume | 970.16 ± 0.15 Å3 |
Cell temperature | 293 ± 2 K |
Ambient diffraction temperature | 293 ± 2 K |
Number of distinct elements | 5 |
Space group number | 2 |
Hermann-Mauguin space group symbol | P -1 |
Hall space group symbol | -P 1 |
Residual factor for all reflections | 0.07 |
Residual factor for significantly intense reflections | 0.0454 |
Weighted residual factors for significantly intense reflections | 0.1221 |
Weighted residual factors for all reflections included in the refinement | 0.1379 |
Goodness-of-fit parameter for all reflections included in the refinement | 1.052 |
Diffraction radiation wavelength | 0.71073 Å |
Diffraction radiation type | MoKα |