Information card for entry 7235988
Formula | C43 H74 Al2 N2 O6 Si |
Calculated formula | C43 H74 Al2 N2 O6 Si |
Title of publication | Homo- and heteroalumoxane silicates |
Authors of publication | García-Ríos, Jessica; Hernández-Campos, René Francisco; Rascón-Cruz, Fernando; Moreno-Martínez, Víctor Augusto; Huerta-Lavorie, Raúl; Velázquez-Carmona, Miguel-Ángel; Cea-Olivares, Raymundo; Martínez-Otero, Diego; Jancik, Vojtech |
Journal of publication | RSC Advances |
Year of publication | 2015 |
Journal volume | 5 |
Journal issue | 121 |
Pages of publication | 99722 |
a | 11.569 ± 0.001 Å |
b | 23.28 ± 0.002 Å |
c | 17.56 ± 0.002 Å |
α | 90° |
β | 95.63 ± 0.01° |
γ | 90° |
Cell volume | 4706.6 ± 0.8 Å3 |
Cell temperature | 100 ± 2 K |
Ambient diffraction temperature | 100 ± 2 K |
Number of distinct elements | 6 |
Space group number | 14 |
Hermann-Mauguin space group symbol | P 1 21/n 1 |
Hall space group symbol | -P 2yn |
Residual factor for all reflections | 0.0631 |
Residual factor for significantly intense reflections | 0.0471 |
Weighted residual factors for significantly intense reflections | 0.1065 |
Weighted residual factors for all reflections included in the refinement | 0.1149 |
Goodness-of-fit parameter for all reflections included in the refinement | 1.026 |
Diffraction radiation wavelength | 0.71073 Å |
Diffraction radiation type | MoKα |