Information card for entry 7236011
Formula | C14 H15 Cu N O7 S |
Calculated formula | C14 H15 Cu N O7 S |
Title of publication | Sulfonated Schiff base copper(ii) complexes as efficient and selective catalysts in alcohol oxidation: syntheses and crystal structures |
Authors of publication | Hazra, Susanta; Martins, Luísa M. D. R. S.; Guedes da Silva, M. Fátima C.; Pombeiro, Armando J. L. |
Journal of publication | RSC Advances |
Year of publication | 2015 |
Journal volume | 5 |
Journal issue | 109 |
Pages of publication | 90079 |
a | 8.599 ± 0.005 Å |
b | 14.399 ± 0.005 Å |
c | 12.598 ± 0.005 Å |
α | 90 ± 0.005° |
β | 96.196 ± 0.005° |
γ | 90 ± 0.005° |
Cell volume | 1550.7 ± 1.2 Å3 |
Cell temperature | 293 ± 2 K |
Ambient diffraction temperature | 293 ± 2 K |
Number of distinct elements | 6 |
Space group number | 14 |
Hermann-Mauguin space group symbol | P 1 21/c 1 |
Hall space group symbol | -P 2ybc |
Residual factor for all reflections | 0.0686 |
Residual factor for significantly intense reflections | 0.0439 |
Weighted residual factors for significantly intense reflections | 0.0966 |
Weighted residual factors for all reflections included in the refinement | 0.1049 |
Goodness-of-fit parameter for all reflections included in the refinement | 1.028 |
Diffraction radiation wavelength | 0.71069 Å |
Diffraction radiation type | MoKα |