Information card for entry 7236026
Formula | C15 H17 F N Sb |
Calculated formula | C15 H17 F N Sb |
Title of publication | Hypervalent diorganoantimony(iii) fluorides via diorganoantimony(iii) cations ‒ a general method of synthesis |
Authors of publication | Preda, Ana Maria; Raţ, Ciprian I.; Silvestru, Cristian; Lang, Heinrich; Rüffer, Tobias; Mehring, Michael |
Journal of publication | RSC Advances |
Year of publication | 2015 |
Journal volume | 5 |
Journal issue | 121 |
Pages of publication | 99832 |
a | 11.3139 ± 0.0008 Å |
b | 8.1198 ± 0.0006 Å |
c | 15.85 ± 0.0012 Å |
α | 90° |
β | 101.487 ± 0.001° |
γ | 90° |
Cell volume | 1426.92 ± 0.18 Å3 |
Cell temperature | 297 ± 2 K |
Ambient diffraction temperature | 297 ± 2 K |
Number of distinct elements | 5 |
Space group number | 14 |
Hermann-Mauguin space group symbol | P 1 21/n 1 |
Hall space group symbol | -P 2yn |
Residual factor for all reflections | 0.0302 |
Residual factor for significantly intense reflections | 0.0281 |
Weighted residual factors for significantly intense reflections | 0.0633 |
Weighted residual factors for all reflections included in the refinement | 0.0645 |
Goodness-of-fit parameter for all reflections included in the refinement | 1.146 |
Diffraction radiation wavelength | 0.71073 Å |
Diffraction radiation type | MoKα |