Information card for entry 7236149
Formula | C30 H22 N2 O2 Sn |
Calculated formula | C30 H22 N2 O2 Sn |
Title of publication | New application of fluorescent organotin compounds derived from Schiff bases: synthesis, X-ray structures, photophysical properties, cytotoxicity and fluorescent bioimaging |
Authors of publication | Jiménez-Pérez, Víctor M.; García-López, María C.; Muñoz-Flores, Blanca M.; Chan-Navarro, Rodrigo; Berrones-Reyes, Jessica C.; Dias, H. V. Rasika; Moggio, Ivana; Arias, Eduardo; Serrano-Mireles, Jesús A.; Chavez-Reyes, Arturo |
Journal of publication | Journal of Materials Chemistry B |
Year of publication | 2015 |
Journal volume | 3 |
Journal issue | 28 |
Pages of publication | 5731 |
a | 9.845 ± 0.0012 Å |
b | 8.6454 ± 0.001 Å |
c | 28.744 ± 0.003 Å |
α | 90° |
β | 93.078 ± 0.001° |
γ | 90° |
Cell volume | 2443 ± 0.5 Å3 |
Cell temperature | 100 ± 2 K |
Ambient diffraction temperature | 100.15 K |
Number of distinct elements | 5 |
Space group number | 14 |
Hermann-Mauguin space group symbol | P 1 21/c 1 |
Hall space group symbol | -P 2ybc |
Residual factor for all reflections | 0.031 |
Residual factor for significantly intense reflections | 0.0287 |
Weighted residual factors for significantly intense reflections | 0.073 |
Weighted residual factors for all reflections included in the refinement | 0.0748 |
Goodness-of-fit parameter for all reflections included in the refinement | 1.065 |
Diffraction radiation wavelength | 0.71073 Å |
Diffraction radiation type | MoKα |