Information card for entry 7236153
Formula | C25 H23 I2 N3 S Zn |
Calculated formula | C25 H23 I2 N3 S Zn |
Title of publication | A series of Zn(ii) terpyridine complexes with enhanced two-photon-excited fluorescence for in vitro and in vivo bioimaging |
Authors of publication | Zhang, Qiong; Tian, Xiaohe; Hu, Zhangjun; Brommesson, Caroline; Wu, Jieying; Zhou, Hongping; Li, Shengli; Yang, Jiaxiang; Sun, Zhaoqi; Tian, Yupeng; Uvdal, Kajsa |
Journal of publication | Journal of Materials Chemistry B |
Year of publication | 2015 |
Journal volume | 3 |
Journal issue | 36 |
Pages of publication | 7213 |
a | 14.035 ± 0.004 Å |
b | 14.277 ± 0.004 Å |
c | 15.099 ± 0.005 Å |
α | 63.305 ± 0.003° |
β | 79.986 ± 0.004° |
γ | 84.168 ± 0.004° |
Cell volume | 2660.9 ± 1.4 Å3 |
Cell temperature | 296 ± 2 K |
Ambient diffraction temperature | 296 ± 2 K |
Number of distinct elements | 6 |
Space group number | 2 |
Hermann-Mauguin space group symbol | P -1 |
Hall space group symbol | -P 1 |
Residual factor for all reflections | 0.1709 |
Residual factor for significantly intense reflections | 0.0654 |
Weighted residual factors for significantly intense reflections | 0.1399 |
Weighted residual factors for all reflections included in the refinement | 0.1751 |
Goodness-of-fit parameter for all reflections included in the refinement | 0.98 |
Diffraction radiation wavelength | 0.71073 Å |
Diffraction radiation type | MoKα |