Information card for entry 7236159
Formula | C33 H50 N O3 P S |
Calculated formula | C33 H50 N O3 P S |
Title of publication | Tunable GUMBOS-based sensor array for label-free detection and discrimination of proteins |
Authors of publication | Galpothdeniya, Waduge Indika S.; Fronczek, Frank R.; Cong, Mingyan; Bhattarai, Nimisha; Siraj, Noureen; Warner, Isiah M. |
Journal of publication | Journal of Materials Chemistry B |
Year of publication | 2016 |
Journal volume | 4 |
Journal issue | 8 |
Pages of publication | 1414 |
a | 10.3977 ± 0.0004 Å |
b | 18.2132 ± 0.0007 Å |
c | 17.4211 ± 0.0006 Å |
α | 90° |
β | 102.071 ± 0.003° |
γ | 90° |
Cell volume | 3226.2 ± 0.2 Å3 |
Cell temperature | 90 ± 0.5 K |
Ambient diffraction temperature | 90 ± 0.5 K |
Number of distinct elements | 6 |
Space group number | 14 |
Hermann-Mauguin space group symbol | P 1 21/c 1 |
Hall space group symbol | -P 2ybc |
Residual factor for all reflections | 0.1341 |
Residual factor for significantly intense reflections | 0.0702 |
Weighted residual factors for significantly intense reflections | 0.1605 |
Weighted residual factors for all reflections included in the refinement | 0.1902 |
Goodness-of-fit parameter for all reflections included in the refinement | 1.017 |
Diffraction radiation wavelength | 1.54184 Å |
Diffraction radiation type | CuKα |