Information card for entry 7236284
Formula | C26 H24 Cd2 N2 O13 |
Calculated formula | C26 H24 Cd2 N2 O13 |
Title of publication | Six new coordination compounds based on rigid 5-(3-carboxy-phenyl)-pyridine-2-carboxylic acid: synthesis, structural variations and properties |
Authors of publication | Song, Jiang-Feng; Jia, Ying-Ying; Zhou, Rui-Sha; Li, Si-Zhe; Qiu, Xiao-Min; Liu, Jie |
Journal of publication | RSC Advances |
Year of publication | 2017 |
Journal volume | 7 |
Journal issue | 12 |
Pages of publication | 7217 |
a | 7.7894 ± 0.0016 Å |
b | 12.085 ± 0.002 Å |
c | 14.169 ± 0.003 Å |
α | 82.94 ± 0.03° |
β | 81.63 ± 0.03° |
γ | 89.49 ± 0.03° |
Cell volume | 1309.5 ± 0.5 Å3 |
Cell temperature | 298 ± 2 K |
Ambient diffraction temperature | 298 ± 2 K |
Number of distinct elements | 5 |
Space group number | 2 |
Hermann-Mauguin space group symbol | P -1 |
Hall space group symbol | -P 1 |
Residual factor for all reflections | 0.0322 |
Residual factor for significantly intense reflections | 0.025 |
Weighted residual factors for significantly intense reflections | 0.0675 |
Weighted residual factors for all reflections included in the refinement | 0.0819 |
Goodness-of-fit parameter for all reflections included in the refinement | 1.179 |
Diffraction radiation wavelength | 0.71073 Å |
Diffraction radiation type | MoKα |