Information card for entry 7236512
Formula | C42 H42 Cd2 N12 O14 S |
Calculated formula | C42 H42 Cd2 N12 O14 S |
Title of publication | Sorption and sensing properties of coordination polymers with mixed 1,3,5-tri(1-imidazolyl)benzene and 2,6-naphthalenedicarboxylate ligands |
Authors of publication | Deng, Ye; Yao, Zhao-Yu; Wang, Peng; Zhao, Yue; Kang, Yan-Shang; Azam, Mohammad; Al-Resayes, Saud I.; Sun, Wei-Yin |
Journal of publication | RSC Advances |
Year of publication | 2017 |
Journal volume | 7 |
Journal issue | 71 |
Pages of publication | 44639 |
a | 23.6468 ± 0.0018 Å |
b | 13.261 ± 0.001 Å |
c | 17.991 ± 0.002 Å |
α | 90° |
β | 126.758 ± 0.001° |
γ | 90° |
Cell volume | 4519.9 ± 0.7 Å3 |
Cell temperature | 293 ± 2 K |
Ambient diffraction temperature | 293 ± 2 K |
Number of distinct elements | 6 |
Space group number | 15 |
Hermann-Mauguin space group symbol | C 1 2/c 1 |
Hall space group symbol | -C 2yc |
Residual factor for all reflections | 0.025 |
Residual factor for significantly intense reflections | 0.0212 |
Weighted residual factors for significantly intense reflections | 0.0483 |
Weighted residual factors for all reflections included in the refinement | 0.0502 |
Goodness-of-fit parameter for all reflections included in the refinement | 1.073 |
Diffraction radiation wavelength | 0.71073 Å |
Diffraction radiation type | MoKα |