Information card for entry 7236688
Formula | C18 H19 I N2 |
Calculated formula | C18 H19 I N2 |
Title of publication | A series of water-soluble A‒π‒A′ typological indolium derivatives with two-photon properties for rapidly detecting HSO3−/SO32−in living cells |
Authors of publication | Zhu, Yingzhong; Du, Wei; Zhang, Mingzhu; Xu, Ying; Song, Leilei; Zhang, Qiong; Tian, Xiaohe; Zhou, Hongping; Wu, Jieying; Tian, Yupeng |
Journal of publication | Journal of Materials Chemistry B |
Year of publication | 2017 |
Journal volume | 5 |
Journal issue | 21 |
Pages of publication | 3862 |
a | 7.2991 ± 0.0012 Å |
b | 18.472 ± 0.003 Å |
c | 12.541 ± 0.002 Å |
α | 90° |
β | 90° |
γ | 90° |
Cell volume | 1690.9 ± 0.5 Å3 |
Cell temperature | 296 ± 2 K |
Ambient diffraction temperature | 296 ± 2 K |
Number of distinct elements | 4 |
Space group number | 36 |
Hermann-Mauguin space group symbol | C m c 21 |
Hall space group symbol | C 2c -2 |
Residual factor for all reflections | 0.021 |
Residual factor for significantly intense reflections | 0.0188 |
Weighted residual factors for significantly intense reflections | 0.0418 |
Weighted residual factors for all reflections included in the refinement | 0.043 |
Goodness-of-fit parameter for all reflections included in the refinement | 1.061 |
Diffraction radiation wavelength | 0.71073 Å |
Diffraction radiation type | MoKα |