Information card for entry 7236692
Formula | C37 H32 Cl2 N4 O2 Zn |
Calculated formula | C37 H32 Cl2 N4 O2 Zn |
Title of publication | A series of terpyridine-based zinc(ii) complexes assembled for third-order nonlinear optical responses in the near-infrared region and recognizing lipid membranes |
Authors of publication | Tang, Yiwen; Kong, Ming; Tian, Xiaohe; Wang, Jinghang; Xie, Qingyuan; Wang, Aidong; Zhang, Qiong; Zhou, Hongping; Wu, Jieying; Tian, Yupeng |
Journal of publication | Journal of Materials Chemistry B |
Year of publication | 2017 |
Journal volume | 5 |
Journal issue | 31 |
Pages of publication | 6348 |
a | 14.289 ± 0.005 Å |
b | 14.212 ± 0.005 Å |
c | 17.032 ± 0.005 Å |
α | 90 ± 0.005° |
β | 109.537 ± 0.005° |
γ | 90 ± 0.005° |
Cell volume | 3259.6 ± 1.9 Å3 |
Cell temperature | 298 ± 2 K |
Ambient diffraction temperature | 298 ± 2 K |
Number of distinct elements | 6 |
Space group number | 14 |
Hermann-Mauguin space group symbol | P 1 21/c 1 |
Hall space group symbol | -P 2ybc |
Residual factor for all reflections | 0.0388 |
Residual factor for significantly intense reflections | 0.0303 |
Weighted residual factors for significantly intense reflections | 0.0741 |
Weighted residual factors for all reflections included in the refinement | 0.0786 |
Goodness-of-fit parameter for all reflections included in the refinement | 1.052 |
Diffraction radiation wavelength | 0.71069 Å |
Diffraction radiation type | MoKα |