Information card for entry 7236699
Formula | C25 H21 N O5 |
Calculated formula | C25 H21 N O5 |
Title of publication | A highly sensitive and rapidly responding fluorescent probe based on a rhodol fluorophore for imaging endogenous hypochlorite in living mice |
Authors of publication | Zhang, Yanhui; Ma, Lin; Tang, Chunchao; Pan, Shengnan; Shi, Donglei; Wang, Shaojing; Li, Minyong; Guo, Yuan |
Journal of publication | Journal of Materials Chemistry B |
Year of publication | 2018 |
Journal volume | 6 |
Journal issue | 5 |
Pages of publication | 725 |
a | 20.42 ± 0.005 Å |
b | 7.929 ± 0.002 Å |
c | 29.104 ± 0.008 Å |
α | 90° |
β | 91.616 ± 0.006° |
γ | 90° |
Cell volume | 4710 ± 2 Å3 |
Cell temperature | 296.15 K |
Ambient diffraction temperature | 296.15 K |
Number of distinct elements | 4 |
Space group number | 15 |
Hermann-Mauguin space group symbol | C 1 2/c 1 |
Hall space group symbol | -C 2yc |
Residual factor for all reflections | 0.1456 |
Residual factor for significantly intense reflections | 0.0701 |
Weighted residual factors for significantly intense reflections | 0.1842 |
Weighted residual factors for all reflections included in the refinement | 0.23 |
Goodness-of-fit parameter for all reflections included in the refinement | 0.982 |
Diffraction radiation wavelength | 0.71073 Å |
Diffraction radiation type | MoKα |