Information card for entry 7236907
Formula | C30 H23 N3 O |
Calculated formula | C30 H23 N3 O |
Title of publication | ESIPT-active multi-color aggregation-induced emission features of triphenylamine‒salicylaldehyde-based unsymmetrical azine family |
Authors of publication | Mathivanan, Moorthy; Tharmalingam, Balamurugan; Lin, Chia-Her; Pandiyan, Baskaran Vijaya; Thiagarajan, Viruthachalam; Murugesapandian, Balasubramanian |
Journal of publication | CrystEngComm |
Year of publication | 2020 |
Journal volume | 22 |
Journal issue | 2 |
Pages of publication | 213 - 228 |
a | 9.7349 ± 0.0002 Å |
b | 26.4673 ± 0.0004 Å |
c | 9.6839 ± 0.0002 Å |
α | 90° |
β | 110.107 ± 0.001° |
γ | 90° |
Cell volume | 2343.05 ± 0.08 Å3 |
Cell temperature | 296 ± 2 K |
Ambient diffraction temperature | 296 ± 2 K |
Number of distinct elements | 4 |
Space group number | 14 |
Hermann-Mauguin space group symbol | P 1 21/c 1 |
Hall space group symbol | -P 2ybc |
Residual factor for all reflections | 0.1827 |
Residual factor for significantly intense reflections | 0.048 |
Weighted residual factors for significantly intense reflections | 0.096 |
Weighted residual factors for all reflections included in the refinement | 0.1255 |
Goodness-of-fit parameter for all reflections included in the refinement | 0.777 |
Diffraction radiation wavelength | 0.71073 Å |
Diffraction radiation type | MoKα |