Information card for entry 7236909
Formula | C26 H21 N3 O |
Calculated formula | C26 H21 N3 O |
Title of publication | ESIPT-active multi-color aggregation-induced emission features of triphenylamine‒salicylaldehyde-based unsymmetrical azine family |
Authors of publication | Mathivanan, Moorthy; Tharmalingam, Balamurugan; Lin, Chia-Her; Pandiyan, Baskaran Vijaya; Thiagarajan, Viruthachalam; Murugesapandian, Balasubramanian |
Journal of publication | CrystEngComm |
Year of publication | 2020 |
Journal volume | 22 |
Journal issue | 2 |
Pages of publication | 213 - 228 |
a | 7.4345 ± 0.0006 Å |
b | 7.7857 ± 0.0007 Å |
c | 18.3205 ± 0.0016 Å |
α | 81.464 ± 0.005° |
β | 87.016 ± 0.005° |
γ | 86.135 ± 0.005° |
Cell volume | 1045.36 ± 0.16 Å3 |
Cell temperature | 296 ± 2 K |
Ambient diffraction temperature | 296 ± 2 K |
Number of distinct elements | 4 |
Space group number | 2 |
Hermann-Mauguin space group symbol | P -1 |
Hall space group symbol | -P 1 |
Residual factor for all reflections | 0.087 |
Residual factor for significantly intense reflections | 0.0459 |
Weighted residual factors for significantly intense reflections | 0.1293 |
Weighted residual factors for all reflections included in the refinement | 0.1549 |
Goodness-of-fit parameter for all reflections included in the refinement | 0.999 |
Diffraction radiation wavelength | 0.71073 Å |
Diffraction radiation type | MoKα |