Information card for entry 7237240
Formula | C28 H18 N4 Na O16 Zn2 |
Calculated formula | C28 H20 N4 Na O16 Zn2 |
Title of publication | Robust heterostructures of a bimetallic sodium‒zinc metal‒organic framework and reduced graphene oxide for high-performance supercapacitors |
Authors of publication | Rajak, Richa; Saraf, Mohit; Mobin, Shaikh M. |
Journal of publication | Journal of Materials Chemistry A |
Year of publication | 2019 |
Journal volume | 7 |
Journal issue | 4 |
Pages of publication | 1725 |
a | 9.7489 ± 0.0005 Å |
b | 10.0757 ± 0.0005 Å |
c | 10.6156 ± 0.0005 Å |
α | 71.619 ± 0.004° |
β | 65.447 ± 0.005° |
γ | 86.347 ± 0.004° |
Cell volume | 897.32 ± 0.09 Å3 |
Cell temperature | 293 ± 2 K |
Ambient diffraction temperature | 293 ± 2 K |
Number of distinct elements | 6 |
Space group number | 2 |
Hermann-Mauguin space group symbol | P -1 |
Hall space group symbol | -P 1 |
Residual factor for all reflections | 0.0757 |
Residual factor for significantly intense reflections | 0.073 |
Weighted residual factors for significantly intense reflections | 0.2023 |
Weighted residual factors for all reflections included in the refinement | 0.2088 |
Goodness-of-fit parameter for all reflections included in the refinement | 1.041 |
Diffraction radiation wavelength | 1.54184 Å |
Diffraction radiation type | CuKα |