Information card for entry 7237258
Formula | C4 Ag5 Cl N20 O12 |
Calculated formula | C4 Ag5 Cl N20 O12 |
Title of publication | Dancing with 5-substituted monotetrazoles, oxygen-rich ions, and silver: towards primary explosives with positive oxygen balance and excellent energetic performance |
Authors of publication | Sun, Qi; Li, Xin; Lin, Qiuhan; Lu, Ming |
Journal of publication | Journal of Materials Chemistry A |
Year of publication | 2019 |
Journal volume | 7 |
Journal issue | 9 |
Pages of publication | 4611 |
a | 12.9865 ± 0.0007 Å |
b | 12.9865 ± 0.0007 Å |
c | 6.7777 ± 0.0009 Å |
α | 90° |
β | 90° |
γ | 90° |
Cell volume | 1143.05 ± 0.18 Å3 |
Cell temperature | 173 ± 2 K |
Ambient diffraction temperature | 173 ± 2 K |
Number of distinct elements | 5 |
Space group number | 86 |
Hermann-Mauguin space group symbol | P 42/n :2 |
Hall space group symbol | -P 4bc |
Residual factor for all reflections | 0.0687 |
Residual factor for significantly intense reflections | 0.0335 |
Weighted residual factors for significantly intense reflections | 0.0471 |
Weighted residual factors for all reflections included in the refinement | 0.0536 |
Goodness-of-fit parameter for all reflections included in the refinement | 1.037 |
Diffraction radiation wavelength | 0.71073 Å |
Diffraction radiation type | MoKα |