Information card for entry 7237269
Formula | C30 H20 N4 O12 Zn2 |
Calculated formula | C30 H20 N4 O12 Zn2 |
Title of publication | A fluorogenic probe based on chelation‒hydrolysis-enhancement mechanism for visualizing Zn2+ in Parkinson's disease models |
Authors of publication | Zhang, Gaobin; Zhao, Yanfei; Peng, Bo; Li, Zheng; Xu, Chenchen; Liu, Yi; Zhang, Chengwu; Voelcker, Nicolas H.; Li, Lin; Huang, Wei |
Journal of publication | Journal of Materials Chemistry B |
Year of publication | 2019 |
Journal volume | 7 |
Journal issue | 14 |
Pages of publication | 2252 |
a | 24.696 ± 0.002 Å |
b | 8.3538 ± 0.0006 Å |
c | 16.7962 ± 0.0014 Å |
α | 90° |
β | 125.219 ± 0.002° |
γ | 90° |
Cell volume | 2830.9 ± 0.4 Å3 |
Cell temperature | 296 ± 2 K |
Ambient diffraction temperature | 296 ± 2 K |
Number of distinct elements | 5 |
Space group number | 15 |
Hermann-Mauguin space group symbol | C 1 2/c 1 |
Hall space group symbol | -C 2yc |
Residual factor for all reflections | 0.0402 |
Residual factor for significantly intense reflections | 0.0312 |
Weighted residual factors for significantly intense reflections | 0.0706 |
Weighted residual factors for all reflections included in the refinement | 0.0747 |
Goodness-of-fit parameter for all reflections included in the refinement | 1.017 |
Diffraction radiation wavelength | 0.71073 Å |
Diffraction radiation type | MoKα |