Information card for entry 7237393
Common name | pyrazinium tetrachloroaurate |
Chemical name | pyrazinium tetrachloroaurate |
Formula | C4 H5 Au Cl4 N2 |
Calculated formula | C4 H5 Au Cl4 N2 |
Title of publication | A giant 2-dimensional dielectric response in a compressed hydrogen-bonded hybrid organic‒inorganic salt |
Authors of publication | Paliwoda, Damian; Szafrański, Marek; Hanfland, Michael; Katrusiak, Andrzej |
Journal of publication | Journal of Materials Chemistry C |
Year of publication | 2018 |
Journal volume | 6 |
Journal issue | 28 |
Pages of publication | 7689 |
a | 7.387 ± 0.0001 Å |
b | 7.387 ± 0.0001 Å |
c | 14.791 ± 0.008 Å |
α | 90° |
β | 90° |
γ | 90° |
Cell volume | 807.1 ± 0.4 Å3 |
Cell temperature | 296 ± 2 K |
Ambient diffraction temperature | 296 ± 2 K |
Ambient diffracton pressure | 6165000 kPa |
Number of distinct elements | 5 |
Space group number | 138 |
Hermann-Mauguin space group symbol | P 42/n c m :2 |
Hall space group symbol | -P 4ac 2ac |
Residual factor for all reflections | 0.0663 |
Residual factor for significantly intense reflections | 0.0543 |
Weighted residual factors for significantly intense reflections | 0.1311 |
Weighted residual factors for all reflections included in the refinement | 0.1376 |
Goodness-of-fit parameter for all reflections included in the refinement | 1.269 |
Diffraction radiation wavelength | 0.41438 Å |
Diffraction radiation type | synchrotron |