Information card for entry 7237424
Formula | C40 H36 N12 O16 P4 Zn3 |
Calculated formula | C40 H36 N12 O16 P4 Zn3 |
Title of publication | An inorganic‒organic hybrid framework from the assembly of an electron-rich diphosphonate and electron-deficient tripyridyl moiety |
Authors of publication | Ma, Yu-Juan; Han, Song-De; Pan, Jie; Mu, Ying; Li, Jin-Hua; Wang, Guo-Ming |
Journal of publication | Journal of Materials Chemistry C |
Year of publication | 2018 |
Journal volume | 6 |
Journal issue | 35 |
Pages of publication | 9341 |
a | 10.9701 ± 0.0007 Å |
b | 14.1004 ± 0.0006 Å |
c | 16.9569 ± 0.0008 Å |
α | 105.651 ± 0.004° |
β | 108.779 ± 0.005° |
γ | 100.702 ± 0.004° |
Cell volume | 2281.9 ± 0.2 Å3 |
Cell temperature | 293 ± 2 K |
Ambient diffraction temperature | 293 ± 2 K |
Number of distinct elements | 6 |
Space group number | 2 |
Hermann-Mauguin space group symbol | P -1 |
Hall space group symbol | -P 1 |
Residual factor for all reflections | 0.0655 |
Residual factor for significantly intense reflections | 0.0411 |
Weighted residual factors for significantly intense reflections | 0.1003 |
Weighted residual factors for all reflections included in the refinement | 0.1092 |
Goodness-of-fit parameter for all reflections included in the refinement | 1.028 |
Diffraction radiation wavelength | 0.71073 Å |
Diffraction radiation type | MoKα |