Information card for entry 7237454
Formula | C6 H17 Br3.4 Cl0.6 N2 Pb |
Calculated formula | C6 H17 Br3.4 Cl0.6 N2 Pb |
Title of publication | Realization of “warm” white light via halide substitution in polar two-dimensional hybrid perovskites (2meptH2)PbClxBr4−x |
Authors of publication | Wang, Sasa; Yao, Yunpeng; Wu, Zhenyue; Peng, Yu; Li, Lina; Luo, Junhua |
Journal of publication | Journal of Materials Chemistry C |
Year of publication | 2018 |
Journal volume | 6 |
Journal issue | 45 |
Pages of publication | 12267 |
a | 24.3453 ± 0.0017 Å |
b | 7.8535 ± 0.0003 Å |
c | 8.1277 ± 0.0005 Å |
α | 90° |
β | 98.776 ± 0.006° |
γ | 90° |
Cell volume | 1535.79 ± 0.16 Å3 |
Cell temperature | 100 ± 0.2 K |
Ambient diffraction temperature | 100 ± 0.2 K |
Number of distinct elements | 6 |
Space group number | 9 |
Hermann-Mauguin space group symbol | C 1 c 1 |
Hall space group symbol | C -2yc |
Residual factor for all reflections | 0.068 |
Residual factor for significantly intense reflections | 0.0579 |
Weighted residual factors for significantly intense reflections | 0.1512 |
Weighted residual factors for all reflections included in the refinement | 0.1658 |
Goodness-of-fit parameter for all reflections included in the refinement | 1.054 |
Diffraction radiation wavelength | 0.71073 Å |
Diffraction radiation type | MoKα |