Information card for entry 7237652
Formula | C73 H65 Co2 N11 O17 |
Calculated formula | C73 H65 Co2 N11 O17 |
Title of publication | Ultrafast post-synthetic modification of a pillared cobalt(ii)-based metal‒organic framework via sulfurization of its pores for high-performance supercapacitors |
Authors of publication | Abazari, Reza; Sanati, Soheila; Morsali, Ali; Slawin, Alexandra M. Z.; Carpenter-Warren, Cameron L.; Chen, Wei; Zheng, Anmin |
Journal of publication | Journal of Materials Chemistry A |
Year of publication | 2019 |
Journal volume | 7 |
Journal issue | 19 |
Pages of publication | 11953 |
a | 9.8591 ± 0.0011 Å |
b | 14.9188 ± 0.0015 Å |
c | 15.0675 ± 0.0013 Å |
α | 112.424 ± 0.009° |
β | 99.484 ± 0.008° |
γ | 106.304 ± 0.009° |
Cell volume | 1871.7 ± 0.4 Å3 |
Cell temperature | 293 ± 2 K |
Ambient diffraction temperature | 293 ± 2 K |
Number of distinct elements | 5 |
Space group number | 2 |
Hermann-Mauguin space group symbol | P -1 |
Hall space group symbol | -P 1 |
Residual factor for all reflections | 0.175 |
Residual factor for significantly intense reflections | 0.0906 |
Weighted residual factors for significantly intense reflections | 0.202 |
Weighted residual factors for all reflections included in the refinement | 0.2382 |
Goodness-of-fit parameter for all reflections included in the refinement | 1.089 |
Diffraction radiation probe | x-ray |
Diffraction radiation wavelength | 0.71073 Å |
Diffraction radiation type | MoKα |