Information card for entry 7237666
Formula | C24 H20 N4 Ni O16 |
Calculated formula | C24 H20 N4 Ni O16 |
Title of publication | A Ca2+ MOF combining highly efficient sorption and capability for voltammetric determination of heavy metal ions in aqueous media |
Authors of publication | Pournara, Anastasia D.; Margariti, Antigoni; Tarlas, Georgios D.; Kourtelaris, Andreas; Petkov, Valeri; Kokkinos, Christos; Economou, Anastasios; Papaefstathiou, Giannis S.; Manos, Manolis J. |
Journal of publication | Journal of Materials Chemistry A |
Year of publication | 2019 |
Journal volume | 7 |
Journal issue | 25 |
Pages of publication | 15432 |
a | 21.728 ± 0.0009 Å |
b | 10.3246 ± 0.0004 Å |
c | 13.1378 ± 0.0005 Å |
α | 90° |
β | 98.983 ± 0.004° |
γ | 90° |
Cell volume | 2911.1 ± 0.2 Å3 |
Cell temperature | 100 ± 2 K |
Ambient diffraction temperature | 100 ± 2 K |
Number of distinct elements | 5 |
Space group number | 15 |
Hermann-Mauguin space group symbol | C 1 2/c 1 |
Hall space group symbol | -C 2yc |
Residual factor for all reflections | 0.0551 |
Residual factor for significantly intense reflections | 0.0479 |
Weighted residual factors for significantly intense reflections | 0.1426 |
Weighted residual factors for all reflections included in the refinement | 0.1508 |
Goodness-of-fit parameter for all reflections included in the refinement | 1.064 |
Diffraction radiation wavelength | 1.54184 Å |
Diffraction radiation type | CuKα |