Information card for entry 7237670
Formula | C12 H33 Bi Cu I8 N4 O0.5 |
Calculated formula | C12 H33 Bi Cu I8 N4 O0.5 |
Title of publication | Two-dimensional lead-free iodide-based hybrid double perovskites: crystal growth, thin-film preparation and photocurrent responses |
Authors of publication | Bi, Le-Yu; Hu, Yue-Qiao; Li, Mu-Qing; Hu, Tian-Li; Zhang, Hao-Lan; Yin, Xing-Tian; Que, Wen-Xiu; Lassoued, Mohamed Saber; Zheng, Yan-Zhen |
Journal of publication | Journal of Materials Chemistry A |
Year of publication | 2019 |
Journal volume | 7 |
Journal issue | 34 |
Pages of publication | 19662 |
a | 17.062 ± 0.006 Å |
b | 19.825 ± 0.007 Å |
c | 18.808 ± 0.007 Å |
α | 90° |
β | 90.297 ± 0.005° |
γ | 90° |
Cell volume | 6362 ± 4 Å3 |
Cell temperature | 296 ± 2 K |
Ambient diffraction temperature | 296.15 K |
Number of distinct elements | 7 |
Space group number | 14 |
Hermann-Mauguin space group symbol | P 1 21/n 1 |
Hall space group symbol | -P 2yn |
Residual factor for all reflections | 0.0686 |
Residual factor for significantly intense reflections | 0.0438 |
Weighted residual factors for significantly intense reflections | 0.088 |
Weighted residual factors for all reflections included in the refinement | 0.0974 |
Goodness-of-fit parameter for all reflections included in the refinement | 1.027 |
Diffraction radiation wavelength | 0.71073 Å |
Diffraction radiation type | MoKα |