Information card for entry 7237683
Formula | C52 H54 N14 O12 Zn2 |
Calculated formula | C52 H53 N14 O12 Zn2 |
Title of publication | Antibiotic-triggered reversible luminescence switching in amine-grafted mixed-linker MOF: exceptional turn-on and ultrafast nanomolar detection of sulfadiazine and adenosine monophosphate with molecular keypad lock functionality |
Authors of publication | Goswami, Ranadip; Mandal, Shyama Charan; Seal, Nilanjan; Pathak, Biswarup; Neogi, Subhadip |
Journal of publication | Journal of Materials Chemistry A |
Year of publication | 2019 |
Journal volume | 7 |
Journal issue | 33 |
Pages of publication | 19471 |
a | 13.657 ± 0.002 Å |
b | 15.099 ± 0.003 Å |
c | 17.129 ± 0.003 Å |
α | 69.483 ± 0.002° |
β | 71.932 ± 0.002° |
γ | 74.038 ± 0.002° |
Cell volume | 3089.6 ± 0.9 Å3 |
Cell temperature | 150 ± 2 K |
Ambient diffraction temperature | 150.15 K |
Number of distinct elements | 5 |
Space group number | 2 |
Hermann-Mauguin space group symbol | P -1 |
Hall space group symbol | -P 1 |
Residual factor for all reflections | 0.0876 |
Residual factor for significantly intense reflections | 0.0652 |
Weighted residual factors for significantly intense reflections | 0.178 |
Weighted residual factors for all reflections included in the refinement | 0.1887 |
Goodness-of-fit parameter for all reflections included in the refinement | 1.061 |
Diffraction radiation wavelength | 0.71073 Å |
Diffraction radiation type | MoKα |