Information card for entry 7237686
Formula | C86 H66 B2 Cd2 F4 N8 O8 |
Calculated formula | C86 H66 B2 Cd2 F4 N8 O8 |
Title of publication | A noble-metal-free photocatalyst system obtained using BODIPY-based MOFs for highly efficient visible-light-driven H2 evolution |
Authors of publication | Yang, Heng; Zhao, Ming; Zhang, Jing; Ma, Ji; Wu, Pengyan; Liu, Wenlong; Wen, Lili |
Journal of publication | Journal of Materials Chemistry A |
Year of publication | 2019 |
Journal volume | 7 |
Journal issue | 36 |
Pages of publication | 20742 |
a | 19.636 ± 0.002 Å |
b | 16.5479 ± 0.0017 Å |
c | 28.621 ± 0.003 Å |
α | 90° |
β | 91.415 ± 0.005° |
γ | 90° |
Cell volume | 9297.1 ± 1.7 Å3 |
Cell temperature | 173 ± 2 K |
Ambient diffraction temperature | 173.15 K |
Number of distinct elements | 7 |
Space group number | 13 |
Hermann-Mauguin space group symbol | P 1 2/c 1 |
Hall space group symbol | -P 2yc |
Residual factor for all reflections | 0.1951 |
Residual factor for significantly intense reflections | 0.137 |
Weighted residual factors for significantly intense reflections | 0.3291 |
Weighted residual factors for all reflections included in the refinement | 0.3631 |
Goodness-of-fit parameter for all reflections included in the refinement | 1.088 |
Diffraction radiation wavelength | 0.71076 Å |
Diffraction radiation type | MoKα |