Information card for entry 7237694
Formula | C33 H35 Cl3 N6 O2 |
Calculated formula | C33 H35 Cl3 N6 O2 |
Title of publication | An efficient biosensor for monitoring Alzheimer's disease risk factors: modulation and disaggregation of the Aβ aggregation process |
Authors of publication | Ma, Siyue; Qiang, Jiabao; Li, Linyang; Mo, Yan; She, Mengyao; Yang, Zheng; Liu, Ping; Zhang, Shengyong; Li, Jianli |
Journal of publication | Journal of Materials Chemistry B |
Year of publication | 2019 |
Journal volume | 7 |
Journal issue | 26 |
Pages of publication | 4124 |
a | 16.13 ± 0.003 Å |
b | 14.858 ± 0.004 Å |
c | 14.836 ± 0.003 Å |
α | 90° |
β | 106.804 ± 0.004° |
γ | 90° |
Cell volume | 3403.8 ± 1.3 Å3 |
Cell temperature | 296 ± 2 K |
Ambient diffraction temperature | 296 ± 2 K |
Number of distinct elements | 5 |
Space group number | 14 |
Hermann-Mauguin space group symbol | P 1 21/c 1 |
Hall space group symbol | -P 2ybc |
Residual factor for all reflections | 0.1983 |
Residual factor for significantly intense reflections | 0.0928 |
Weighted residual factors for significantly intense reflections | 0.249 |
Weighted residual factors for all reflections included in the refinement | 0.3188 |
Goodness-of-fit parameter for all reflections included in the refinement | 1.031 |
Diffraction radiation wavelength | 0.71073 Å |
Diffraction radiation type | MoKα |