Information card for entry 7237710
Formula | C34 H22 N4 O S |
Calculated formula | C34 H22 N4 O S |
Title of publication | Efficient and versatile mechanochromic luminescence of phenanthroimidazolylbenzothiadiazoles: tricolor switching and directional control over the chromism |
Authors of publication | Nagai, Sayaka; Yamashita, Maho; Tachikawa, Takashi; Ubukata, Takashi; Asami, Masatoshi; Ito, Suguru |
Journal of publication | Journal of Materials Chemistry C |
Year of publication | 2019 |
Journal volume | 7 |
Journal issue | 17 |
Pages of publication | 4988 |
a | 19.24398 ± 0.00015 Å |
b | 21.13245 ± 0.00017 Å |
c | 6.19786 ± 0.00005 Å |
α | 90° |
β | 90° |
γ | 90° |
Cell volume | 2520.5 ± 0.03 Å3 |
Cell temperature | 223 K |
Ambient diffraction temperature | 223 K |
Number of distinct elements | 5 |
Space group number | 33 |
Hermann-Mauguin space group symbol | P n a 21 |
Hall space group symbol | P 2c -2n |
Residual factor for all reflections | 0.0319 |
Residual factor for significantly intense reflections | 0.0309 |
Weighted residual factors for significantly intense reflections | 0.0805 |
Weighted residual factors for all reflections included in the refinement | 0.0814 |
Goodness-of-fit parameter for all reflections included in the refinement | 1.044 |
Diffraction radiation wavelength | 1.54184 Å |
Diffraction radiation type | CuKα |