Information card for entry 7237716
Chemical name | 2g |
Formula | C17 H15 B F2 N2 O2 |
Calculated formula | C17 H15 B F2 N2 O2 |
Title of publication | AIE-active difluoroboronated acylhydrozone dyes (BOAHY) emitting across the entire visible region and their photo-switching properties |
Authors of publication | Yu, Changjiang; Hao, Erhong; Fang, Xingbao; Wu, Qinghua; Wang, Long; Li, Jiahua; Xu, Linli; Jiao, Lijuan; Wong, Wai-Yeung |
Journal of publication | Journal of Materials Chemistry C |
Year of publication | 2019 |
Journal volume | 7 |
Journal issue | 11 |
Pages of publication | 3269 |
a | 7.656 ± 0.0009 Å |
b | 10.0738 ± 0.0011 Å |
c | 11.2184 ± 0.0012 Å |
α | 112.305 ± 0.001° |
β | 97.312 ± 0.001° |
γ | 91.868 ± 0.001° |
Cell volume | 790.88 ± 0.15 Å3 |
Cell temperature | 293 ± 2 K |
Ambient diffraction temperature | 293 ± 2 K |
Number of distinct elements | 6 |
Space group number | 2 |
Hermann-Mauguin space group symbol | P -1 |
Hall space group symbol | -P 1 |
Residual factor for all reflections | 0.0483 |
Residual factor for significantly intense reflections | 0.039 |
Weighted residual factors for significantly intense reflections | 0.1115 |
Weighted residual factors for all reflections included in the refinement | 0.1207 |
Goodness-of-fit parameter for all reflections included in the refinement | 1.052 |
Diffraction radiation wavelength | 0.71073 Å |
Diffraction radiation type | MoKα |